BDBM50348050 CHEMBL1800497
SMILES CC1(C)CC(CCNc2ccc(Cl)c(F)c2)(CCO1)c1ccccc1
InChI Key InChIKey=GVDDFRANKHNVIL-UHFFFAOYSA-N
Data  1 IC50
  Tab Delimited (TSV)   2D SDfile   Computed 3D by Vconf -m prep SDfile
Find this compound or compounds like it in BindingDB:
Activity Spreadsheet -- Enzyme Inhibition Constant Data from BindingDB
Found 1 hit for monomerid = 50348050
TargetProtein-S-isoprenylcysteine O-methyltransferase(Homo sapiens (Human))
Myrexis
Curated by ChEMBL
LigandPNGBDBM50348050(CHEMBL1800497)
Affinity DataIC50:  470nM. Assay description: Inhibition of human recombinant C-terminal His6-tagged ICMT assessed as methylation of N-acetyl-S-geranylgeranylcysteine using SAM as methyl donor su...
In DepthDetails ArticlePubMed